Ардуино. Ошибка компилятора

lylyk
Offline
Зарегистрирован: 14.03.2019

Создала проект, сейчас компилятор выводит ошибку. Помогите пожалуйста с этой проблемой, я новенькая в этом деле..



Вот:

In function 'global constructors keyed to 65535_0_sketch_mar14a.ino.cpp.o':



lto1.exe: internal compiler error: Segmentation fault



Please submit a full bug report,



with preprocessed source if appropriate.



See <http://gcc.gnu.org/bugs.html> for instructions.



lto-wrapper.exe: fatal error: C:\Program Files\WindowsApps\ArduinoLLC.ArduinoIDE_1.8.19.0_x86__mdqgnx93n4wtt\hardware\tools\avr/bin/avr-gcc returned 1 exit status



compilation terminated.



c:/program files/windowsapps/arduinollc.arduinoide_1.8.19.0_x86__mdqgnx93n4wtt/hardware/tools/avr/bin/../lib/gcc/avr/5.4.0/../../../../avr/bin/ld.exe: error: lto-wrapper failed



collect2.exe: error: ld returned 1 exit status



exit status 1

Ошибка компиляции для платы Arduino/Genuino Uno.

ЕвгенийП
ЕвгенийП аватар
Онлайн
Зарегистрирован: 25.05.2015

1. Поставьте нормальную, стабильную версию IDE.

2. Если проблема останется, отключите lto